{"text_format":"3","workbook":"xlsx","n_sheets":11,"sheets":["Daten","Setup","Gesamt","Club1","Club2","Spielbericht","Spielbericht (2)","Zusatzblatt","Strafzeitencodes","Penaltyschießen","BesondereVorkommnisse"],"not_rendered":{"images":8,"macros":1,"defined_names":11},"read":"whole","date_system":"1900"}

{"sheet":"Daten","index":0,"n_rows":26,"n_cols":5,"rows_kept":26,"hidden":true}
["Codes","Strafen","Count Strafe","Spielzeiten","Verlängerung"]
["A",2,2,{"v":1200,"d":"12:00"},{"v":500,"d":"05:00"}]
["B",5,5,{"v":1500,"d":"15:00"},{"v":1000,"d":"10:00"}]
["C",10,10,{"v":2000,"d":"20:00"}]
["D","5+GM",5]
["E","10+GM",10]
["F","GM"]
["G","MP"]
{"$rows_left_out":19}
{"sheet":"Setup","index":1,"n_rows":17,"n_cols":11,"rows_kept":17,"merged":[[0,0,0,7],[0,10,0,11],[10,0,10,3],[11,0,11,1],[11,2,11,3]]}
["Setup zum Spiel",{"$nulls":9},"Zum Schluss!"]
[]
["Spielort","a-Heim",null,null,"Passnummer","Verein","Nachname","Vorname"]
["Datum",null,null,"Zeitnehmer 1","5001","a-Heim","C","a"]
["Startzeit",null,null,"Zeitnehmer 2","5002","a-Heim","C","b"]
["Endzeit",null,null,"Schiedsrichter 1","5003","b-Heim","D","a"]
["Spielnummer*",null,null,"Schiedsrichter 2","5004","b-Heim","D","b"]
["Spieltyp","Meisterschaft",null,"Tech. Direktor","5005","c-Heim","E","a"]
{"$rows_left_out":10}
{"sheet":"Gesamt","index":2,"n_rows":37,"n_cols":6,"rows_kept":37,"hidden":true}
["Passnummer","Trikotnummer","Funktion","Nachname","Vorname","Verein"]
[{"$f":"IF(Club1!E8=\"\",\"\",Club1!E8)","v":1000},{"$f":"IF(Club1!A8=\"\",\"\",Club1!A8)","v":1},{"$f":"IF(Club1!B8=\"\",\"\",Club1!B8)","v":"C"},{"$f":"IF(Club1!C8=\"\",\"\",Club1!C8)","v":"A"},{"$f":"IF(Club1!D8=\"\",\"\",Club1!D8)","v":"a"},{"$f":"IF(Club1!$C$1=\"\",\"\",Club1!$C$1)","v":"a-Team"}]
[{"$f":"IF(Club1!E9=\"\",\"\",Club1!E9)","v":1001},{"$f":"IF(Club1!A9=\"\",\"\",Club1!A9)","v":2},{"$f":"IF(Club1!B9=\"\",\"\",Club1!B9)","v":"A"},{"$f":"IF(Club1!C9=\"\",\"\",Club1!C9)","v":"A"},{"$f":"IF(Club1!D9=\"\",\"\",Club1!D9)","v":"b"},{"$f":"IF(Club1!$C$1=\"\",\"\",Club1!$C$1)","v":"a-Team"}]
[{"$f":"IF(Club1!E10=\"\",\"\",Club1!E10)","v":1002},{"$f":"IF(Club1!A10=\"\",\"\",Club1!A10)","v":3},{"$f":"IF(Club1!B10=\"\",\"\",Club1!B10)","v":"G"},{"$f":"IF(Club1!C10=\"\",\"\",Club1!C10)","v":"A"},{"$f":"IF(Club1!D10=\"\",\"\",Club1!D10)","v":"c"},{"$f":"IF(Club1!$C$1=\"\",\"\",Club1!$C$1)","v":"a-Team"}]
[{"$f":"IF(Club1!E11=\"\",\"\",Club1!E11)","v":1003},{"$f":"IF(Club1!A11=\"\",\"\",Club1!A11)","v":4},{"$f":"IF(Club1!B11=\"\",\"\",Club1!B11)","v":"G"},{"$f":"IF(Club1!C11=\"\",\"\",Club1!C11)","v":"A"},{"$f":"IF(Club1!D11=\"\",\"\",Club1!D11)","v":"d"},{"$f":"IF(Club1!$C$1=\"\",\"\",Club1!$C$1)","v":"a-Team"}]
[{"$f":"IF(Club1!E12=\"\",\"\",Club1!E12)","v":1004},{"$f":"IF(Club1!A12=\"\",\"\",Club1!A12)","v":5},{"$f":"IF(Club1!B12=\"\",\"\",Club1!B12)","v":"F"},{"$f":"IF(Club1!C12=\"\",\"\",Club1!C12)","v":"A"},{"$f":"IF(Club1!D12=\"\",\"\",Club1!D12)","v":"e"},{"$f":"IF(Club1!$C$1=\"\",\"\",Club1!$C$1)","v":"a-Team"}]
[{"$f":"IF(Club1!E13=\"\",\"\",Club1!E13)","v":1005},{"$f":"IF(Club1!A13=\"\",\"\",Club1!A13)","v":6},{"$f":"IF(Club1!B13=\"\",\"\",Club1!B13)","v":"F"},{"$f":"IF(Club1!C13=\"\",\"\",Club1!C13)","v":"A"},{"$f":"IF(Club1!D13=\"\",\"\",Club1!D13)","v":"f"},{"$f":"IF(Club1!$C$1=\"\",\"\",Club1!$C$1)","v":"a-Team"}]
[{"$f":"IF(Club1!E14=\"\",\"\",Club1!E14)","v":1006},{"$f":"IF(Club1!A14=\"\",\"\",Club1!A14)","v":7},{"$f":"IF(Club1!B14=\"\",\"\",Club1!B14)","v":"F"},{"$f":"IF(Club1!C14=\"\",\"\",Club1!C14)","v":"A"},{"$f":"IF(Club1!D14=\"\",\"\",Club1!D14)","v":"g"},{"$f":"IF(Club1!$C$1=\"\",\"\",Club1!$C$1)","v":"a-Team"}]
{"$rows_left_out":30}
{"sheet":"Club1","index":3,"n_rows":27,"n_cols":7,"rows_kept":27,"merged":[[0,0,0,1],[0,2,0,3],[1,0,1,1],[1,2,1,4]]}
["Mannschaft 1:",null,"a-Team",null,1,"Spieleranzahl:",{"$f":"COUNTA(E8:E25)","v":18}]
["Liga:",null,"AB"]
[]
[null,"Coach","Nachname","Vorname"]
[null,null,"A","z"]
[]
["Trikotnummer","Funktion","Nachname","Vorname","Passnummer"]
[1,"C","A","a",1000]
{"$rows_left_out":20}
{"sheet":"Club2","index":4,"n_rows":27,"n_cols":7,"rows_kept":27,"merged":[[0,0,0,1],[0,2,0,3],[1,0,1,1],[1,2,1,4]]}
["Mannschaft 2:",null,"b-Team",null,2,"Spieleranzahl:",{"$f":"COUNTA(E8:E25)","v":18}]
["Liga:",null,"AB"]
[]
[null,"Coach","Nachname","Vorname"]
[null,null,"B","z"]
[]
["Trikotnummer","Funktion","Nachname","Vorname","Passnummer"]
[1,"C","B","a",2001]
{"$rows_left_out":20}
{"sheet":"Spielbericht","index":5,"n_rows":56,"n_cols":39,"rows_kept":56,"merged":[[0,0,5,2],[0,3,5,8],[0,10,0,15],[0,16,0,23],[0,24,0,29],[0,32,0,33],[1,9,3,9],[1,10,3,14],[1,17,3,17],[1,18,3,18],[1,19,3,19],[1,21,3,21],[1,22,3,22],[1,23,3,23],[1,25,3,25],[1,27,3,27],[1,30,3,30],[4,11,4,14],[5,11,5,14],[6,0,7,2],[6,3,7,7],[8,0,9,2],[8,3,9,7],[8,8,9,8],[8,11,8,14],[9,11,9,14],[10,0,11,2],[10,3,11,7],[10,8,11,8],[10,11,10,14],[11,11,11,14],[12,0,12,2],[12,3,13,5],[12,7,13,8],[12,11,12,14],[12,32,12,33],[13,0,13,2],[13,11,13,14],[14,2,15,2],[14,5,15,5],[14,6,14,7],[14,8,15,8],[14,11,14,14],[15,6,15,7],[15,11,15,14],[16,0,16,3],[16,6,16,7],[16,11,16,14],[17,0,17,3],[17,6,17,7],[17,11,17,14],[18,0,18,3],[18,6,18,7],[18,11,18,14],[19,0,20,0],[19,2,19,3],[19,7,19,8],[19,11,19,14],[20,2,20,3],[20,7,20,8],[20,11,20,14],[21,2,23,3],[21,5,23,5],[21,6,23,6],[21,7,23,8],[21,11,21,14],[22,0,23,0],[22,9,26,10],[22,11,24,11],[22,12,22,14],[22,15,24,15],[22,16,23,16],[22,17,23,17],[22,18,23,18],[22,19,23,19],[22,20,23,20],[22,21,23,21],[22,22,23,22],[22,23,23,23],[22,24,23,24],[22,25,23,25],[22,26,23,26],[22,27,23,27],[22,28,23,28],[22,29,23,29],[22,30,23,30],[23,12,23,14],[24,0,25,0],[24,2,26,3],[24,5,26,5],[24,6,26,6],[24,7,26,8],[24,12,24,14],[24,16,25,16],[24,17,25,17],[24,18,25,18],[24,19,25,19],[24,20,25,21],[24,22,25,23],[24,24,25,24],[24,25,25,25],[24,26,25,26],[24,27,25,27],[24,28,25,28],[24,29,25,29],[24,30,25,30],[25,11,26,11],[25,12,26,15],[26,16,26,19],[26,24,26,26],[27,0,29,0],[27,2,29,3],[27,5,29,5],[27,6,29,6],[27,7,29,8],[27,9,29,9],[27,10,29,15],[27,16,29,23],[27,24,29,29],[30,0,32,0],[30,2,32,3],[30,5,32,5],[30,6,32,6],[30,7,32,8],[30,9,32,9],[30,10,32,14],[30,17,32,17],[30,18,32,18],[30,19,32,19],[30,21,32,21],[30,22,32,22],[30,23,32,23],[30,25,32,25],[30,27,32,27],[30,30,32,30],[33,0,34,0],[33,2,34,3],[33,5,34,5],[33,6,34,6],[33,7,34,8],[33,11,33,14],[34,11,34,14],[35,0,35,8],[36,0,36,5],[36,6,37,8],[37,0,37,5],[37,11,37,14],[38,2,38,3],[38,7,38,8],[38,11,38,14],[39,1,40,1],[39,2,40,3],[39,4,40,4],[39,5,40,5],[39,6,40,6],[39,7,40,8],[39,11,39,14],[40,11,40,14],[41,1,42,1],[41,2,42,3],[41,4,42,4],[41,5,42,5],[41,6,41,8],[41,11,41,14],[42,6,42,8],[42,11,42,14],[43,1,44,1],[43,2,44,3],[43,4,44,4],[43,5,44,5],[43,11,43,14],[44,6,45,8],[44,11,44,14],[45,1,46,1],[45,2,46,3],[45,4,46,4],[45,5,46,5],[45,11,45,14],[46,11,46,14],[47,0,48,0],[47,1,48,1],[47,2,48,3],[47,4,48,4],[47,5,48,5],[47,6,48,8],[47,11,47,14],[48,11,48,14],[49,3,54,8],[49,11,49,14],[50,11,50,14],[51,0,52,2],[51,9,55,10],[51,11,53,11],[51,12,51,14],[51,15,53,15],[51,16,52,16],[51,17,52,17],[51,18,52,18],[51,19,52,19],[51,20,52,20],[51,21,52,21],[51,22,52,22],[51,23,52,23],[51,24,52,24],[51,25,52,25],[51,26,52,26],[51,27,52,27],[51,28,52,28],[51,29,52,29],[51,30,52,30],[52,12,52,14],[53,0,54,2],[53,12,53,14],[53,16,54,16],[53,17,54,17],[53,18,54,18],[53,19,54,19],[53,20,54,21],[53,22,54,23],[53,24,54,24],[53,25,54,25],[53,26,54,26],[53,27,54,27],[53,28,54,28],[53,29,54,29],[53,30,54,30],[54,11,55,11],[54,12,55,15],[55,0,55,7],[55,16,55,19],[55,24,55,26]]}
[{"$nulls":3},"e-Match Sheet Skaterhockey\ne-Spielbericht Skaterhockey",{"$nulls":5},1,{"$f":"D9","v":"a-Team 1"},{"$nulls":5},"Goals/Torschützen",{"$nulls":7},"Penalties/Strafen",{"$nulls":7},"Spielbeginn / -ende",null,null,"Club1","Club2"]
[{"$nulls":9},"Nr. No.","Surname                               Forname\nName                                    Vorname",{"$nulls":4},"Card","Time","G","A","T","Time","G","A","T","Time","Nr. No.",null,"Count","Fine",null,"Nummer\nStrafzeit",{"$nulls":4},"Drittel 1",{"$f":"Setup!B13","v":2000}]
[{"$nulls":15},"Pass","Zeit",{"$nulls":3},"Zeit",{"$nulls":3},"Zeit",null,"min",null,"Ende","Code",{"$nulls":5},"Drittel 2",{"$f":"AK2*2","v":4000}]
[{"$nulls":15},"No.","Temps",{"$nulls":3},"Temps",{"$nulls":14},"Drittel 3",{"$f":"AK2*3","v":6000}]
[{"$nulls":9},{"$f":"IF(INDIRECT($AJ$1&\"!a8\")=\"\",\"\",INDIRECT($AJ$1&\"!a8\"))","v":1},"C",{"$f":"IF(J5=\"\",\"\",CONCATENATE(IF(INDIRECT($AJ$1&\"!c8\")=\"\",\"\",INDIRECT($AJ$1&\"!c8\")),\", \",IF(INDIRECT($AJ$1&\"!d8\")=\"\",\"\",INDIRECT($AJ$1&\"!d8\"))))","v":"A, a"},{"$f":"IF(INDIRECT($AJ$1&\"!A7\")=\"\",\"\",INDIRECT($AJ$1&\"!A7\"))","v":"Trikotnummer"},"Trikotnummer","Trikotnummer",{"$f":"IF(INDIRECT($AJ$1&\"!e8\")=\"\",\"\",INDIRECT($AJ$1&\"!e8\"))","v":1000},{"$nulls":3},{"$f":"IF(TRIM(Q5)=\"\",\"\",1)","v":""},{"$nulls":3},{"$f":"IF(TRIM(U5)=\"\",\"\",T25+1)","v":""},{"$nulls":3},{"$f":"IF(AA5=\"\",0,VLOOKUP(AA5,Daten!$B$2:$C$11,2,FALSE))","v":{"v":0,"d":"0.0"}},null,null,1,{"$nulls":4},"Overtime",{"$f":"AK4+Setup!D13*Setup!D14","v":6000}]
[{"$nulls":9},{"$f":"IF(INDIRECT($AJ$1&\"!a9\")=\"\",\"\",INDIRECT($AJ$1&\"!a9\"))","v":2},"A",{"$f":"IF(J6=\"\",\"\",CONCATENATE(IF(INDIRECT($AJ$1&\"!c9\")=\"\",\"\",INDIRECT($AJ$1&\"!c9\")),\", \",IF(INDIRECT($AJ$1&\"!d9\")=\"\",\"\",INDIRECT($AJ$1&\"!d9\"))))","v":"A, b"},{"$f":"IF(INDIRECT($AJ$1&\"!A7\")=\"\",\"\",INDIRECT($AJ$1&\"!A7\"))","v":"Trikotnummer"},{"$f":"IF(INDIRECT($AJ$1&\"!A7\")=\"\",\"\",INDIRECT($AJ$1&\"!A7\"))","v":"Trikotnummer"},{"$f":"IF(INDIRECT($AJ$1&\"!A7\")=\"\",\"\",INDIRECT($AJ$1&\"!A7\"))","v":"Trikotnummer"},{"$f":"IF(INDIRECT($AJ$1&\"!e9\")=\"\",\"\",INDIRECT($AJ$1&\"!e9\"))","v":1001},{"$nulls":3},{"$f":"IF(TRIM(Q6)=\"\",\"\",T5+1)","v":""},{"$nulls":3},{"$f":"IF(TRIM(U6)=\"\",\"\",X5+1)","v":""},{"$nulls":3},{"$f":"IF(AA6=\"\",0,VLOOKUP(AA6,Daten!$B$2:$C$11,2,FALSE))","v":{"v":0,"d":"0.0"}},null,null,2,{"$nulls":4},"AnzahlDrittel",{"$f":"Setup!B14","v":3}]
[{"$nulls":3},"   Team / Mannschaft",{"$nulls":4},"League",{"$f":"IF(INDIRECT($AJ$1&\"!a10\")=\"\",\"\",INDIRECT($AJ$1&\"!a10\"))","v":3},"G",{"$f":"IF(J7=\"\",\"\",CONCATENATE(IF(INDIRECT($AJ$1&\"!c10\")=\"\",\"\",INDIRECT($AJ$1&\"!c10\")),\", \",IF(INDIRECT($AJ$1&\"!d10\")=\"\",\"\",INDIRECT($AJ$1&\"!d10\"))))","v":"A, c"},{"$nulls":3},{"$f":"IF(INDIRECT($AJ$1&\"!e10\")=\"\",\"\",INDIRECT($AJ$1&\"!e10\"))","v":1002},{"$nulls":3},{"$f":"IF(TRIM(Q7)=\"\",\"\",T6+1)","v":""},{"$nulls":3},"",{"$nulls":3},{"$f":"IF(AA7=\"\",0,VLOOKUP(AA7,Daten!$B$2:$C$11,2,FALSE))","v":{"v":0,"d":"0.0"}},null,null,3]
[{"$nulls":8},"Liga",{"$f":"IF(INDIRECT($AJ$1&\"!a11\")=\"\",\"\",INDIRECT($AJ$1&\"!a11\"))","v":4},"G",{"$f":"IF(J8=\"\",\"\",CONCATENATE(IF(INDIRECT($AJ$1&\"!c11\")=\"\",\"\",INDIRECT($AJ$1&\"!c11\")),\", \",IF(INDIRECT($AJ$1&\"!d11\")=\"\",\"\",INDIRECT($AJ$1&\"!d11\"))))","v":"A, d"},{"$nulls":3},{"$f":"IF(INDIRECT($AJ$1&\"!e11\")=\"\",\"\",INDIRECT($AJ$1&\"!e11\"))","v":1003},{"$nulls":3},"",{"$nulls":3},"",{"$nulls":3},{"$f":"IF(AA8=\"\",0,VLOOKUP(AA8,Daten!$B$2:$C$11,2,FALSE))","v":{"v":0,"d":"0.0"}},null,null,4,{"$nulls":4},"Overtime?"]
{"$rows_left_out":49}
{"sheet":"Spielbericht (2)","index":6,"n_rows":56,"n_cols":39,"rows_kept":56,"hidden":true,"merged":[[0,0,5,2],[0,3,5,8],[0,10,0,15],[0,16,0,23],[0,24,0,29],[0,31,22,31],[0,32,0,33],[0,34,22,34],[1,9,3,9],[1,10,3,14],[1,17,3,17],[1,18,3,18],[1,19,3,19],[1,21,3,21],[1,22,3,22],[1,23,3,23],[1,25,3,25],[1,27,3,27],[1,30,3,30],[1,32,22,33],[4,11,4,14],[5,11,5,14],[6,0,7,2],[6,3,7,7],[7,35,7,36],[8,0,9,2],[8,3,9,7],[8,8,9,8],[8,11,8,14],[9,11,9,14],[10,0,11,2],[10,3,11,7],[10,8,11,8],[10,11,10,14],[11,11,11,14],[12,0,12,2],[12,3,13,5],[12,7,13,8],[12,11,12,14],[13,0,13,2],[13,11,13,14],[14,2,15,2],[14,5,15,5],[14,8,15,8],[14,11,14,14],[15,11,15,14],[16,11,16,14],[17,11,17,14],[17,35,17,36],[18,11,18,14],[19,0,20,0],[19,11,19,14],[20,11,20,14],[21,2,23,3],[21,5,23,5],[21,6,23,6],[21,7,23,8],[21,11,21,14],[22,9,26,10],[22,11,24,11],[22,12,22,14],[22,15,24,15],[22,16,23,16],[22,17,23,17],[22,18,23,18],[22,19,23,19],[22,20,23,20],[22,21,23,21],[22,22,23,22],[22,23,23,23],[22,24,23,24],[22,25,23,25],[22,26,23,26],[22,27,23,27],[22,28,23,28],[22,29,23,29],[22,30,23,30],[23,12,23,14],[24,2,26,3],[24,5,26,5],[24,6,26,6],[24,7,26,8],[24,12,24,14],[24,16,25,16],[24,17,25,17],[24,18,25,18],[24,19,25,19],[24,20,25,21],[24,22,25,23],[24,24,25,24],[24,25,25,25],[24,26,25,26],[24,27,25,27],[24,28,25,28],[24,29,25,29],[24,30,25,30],[25,11,26,11],[25,12,26,15],[26,16,26,19],[26,24,26,26],[27,2,29,3],[27,5,29,5],[27,6,29,6],[27,7,29,8],[27,9,29,9],[27,10,29,15],[27,16,29,23],[27,24,29,29],[30,2,32,3],[30,5,32,5],[30,6,32,6],[30,7,32,8],[30,9,32,9],[30,10,32,14],[30,17,32,17],[30,18,32,18],[30,19,32,19],[30,21,32,21],[30,22,32,22],[30,23,32,23],[30,25,32,25],[30,27,32,27],[30,30,32,30],[33,2,34,3],[33,5,34,5],[33,6,34,6],[33,7,34,8],[33,11,33,14],[34,11,34,14],[35,5,35,6],[36,6,37,8],[37,11,37,14],[38,2,38,3],[38,7,38,8],[38,11,38,14],[39,1,40,1],[39,2,40,3],[39,4,40,4],[39,5,40,5],[39,6,40,6],[39,7,40,8],[39,11,39,14],[40,11,40,14],[41,1,42,1],[41,2,42,3],[41,4,42,4],[41,5,42,5],[41,6,41,8],[41,11,41,14],[42,6,42,8],[42,11,42,14],[43,1,44,1],[43,2,44,3],[43,4,44,4],[43,5,44,5],[43,11,43,14],[44,6,45,8],[44,11,44,14],[45,1,46,1],[45,2,46,3],[45,4,46,4],[45,5,46,5],[45,11,45,14],[46,11,46,14],[47,1,48,1],[47,2,48,3],[47,4,48,4],[47,5,48,5],[47,6,48,8],[47,11,47,14],[48,11,48,14],[49,3,54,8],[49,11,49,14],[50,11,50,14],[51,0,52,2],[51,9,55,10],[51,11,53,11],[51,12,51,14],[51,15,53,15],[51,16,52,16],[51,17,52,17],[51,18,52,18],[51,19,52,19],[51,20,52,20],[51,21,52,21],[51,22,52,22],[51,23,52,23],[51,24,52,24],[51,25,52,25],[51,26,52,26],[51,27,52,27],[51,28,52,28],[51,29,52,29],[51,30,52,30],[52,12,52,14],[53,0,54,2],[53,12,53,14],[53,16,54,16],[53,17,54,17],[53,18,54,18],[53,19,54,19],[53,20,54,21],[53,22,54,23],[53,24,54,24],[53,25,54,25],[53,26,54,26],[53,27,54,27],[53,28,54,28],[53,29,54,29],[53,30,54,30],[54,11,55,11],[54,12,55,15],[55,0,55,7],[55,16,55,19],[55,24,55,26]]}
[{"$nulls":3},"Match Sheet Skater Hockey                        Spielbericht Inline Hockey                         Rapport de jeu                                             Rapporto di gara                                        ",{"$nulls":5},1,{"$f":"D9","v":18},{"$nulls":5},"Goals/Torschützen/Buts/Reti",{"$nulls":7},"Penalties/Strafen/Punitions",{"$nulls":7},"Zum Schluss!",null,null,"Club1","Club2"]
[{"$nulls":9},"Nr. No.","Surname/Name                 Forname/Vorname        Nom/Prénom                     Nome/Cognome",{"$nulls":4},"Card/Pass","Time","G","A","T","Time","G","A","T","Time","Nr. No.",null,"Count","On/",null,"Nummer\nStrafzeit",{"$nulls":4},"Drittel 1",{"$f":"VLOOKUP(I9,Daten!#REF!,2,FALSE)","v":{"$error":"#REF!"}}]
[{"$nulls":15},"Lic./Tess","Zeit",{"$nulls":3},"Zeit",{"$nulls":3},"Zeit",null,"min",null,"Ende/","code",{"$nulls":5},"Drittel 2",{"$f":"AK2*2","v":{"$error":"#REF!"}}]
[{"$nulls":15},"No.","Temps",{"$nulls":3},"Temps",{"$nulls":3},"Temps",{"$nulls":3},"Fin/Fine",{"$nulls":6},"Drittel 3",{"$f":"AK2*3","v":{"$error":"#REF!"}}]
[{"$nulls":9},{"$f":"IF(INDIRECT($AJ$1&\"!A2\")=\"\",\"\",INDIRECT($AJ$1&\"!A2\"))","v":"Liga:"},"C",{"$nulls":8},{"$f":"IF(Q5=\"\",\"\",1)","v":""},{"$nulls":3},{"$f":"IF(U5=\"\",\"\",T25+1)","v":""},{"$nulls":3},{"$f":"IF(AA5=\"\",0,VLOOKUP(AA5,Daten!$B$2:$C$11,2,FALSE))","v":{"v":0,"d":"0.0"}},null,null,1,{"$nulls":4},"Overtime",{"$f":"AK4+VLOOKUP(I9,Daten!#REF!,4,FALSE)*VLOOKUP(I9,Daten!#REF!,5,FALSE)","v":{"$error":"#REF!"}}]
[{"$nulls":9},{"$f":"IF(INDIRECT($AJ$1&\"!A3\")=\"\",\"\",INDIRECT($AJ$1&\"!A3\"))","v":""},"A",{"$nulls":8},{"$f":"IF(Q6=\"\",\"\",T5+1)","v":""},{"$nulls":3},{"$f":"IF(U6=\"\",\"\",X5+1)","v":""},{"$nulls":3},{"$f":"IF(AA6=\"\",0,VLOOKUP(AA6,Daten!$B$2:$C$11,2,FALSE))","v":{"v":0,"d":"0.0"}},null,null,2,{"$nulls":4},"AnzahlDrittel",{"$f":"VLOOKUP(I9,Daten!#REF!,3,FALSE)","v":{"$error":"#REF!"}}]
[{"$nulls":3},"   Team/Mannschaft/Club/Società",{"$nulls":4},"League/Liga",{"$f":"IF(INDIRECT($AJ$1&\"!A4\")=\"\",\"\",INDIRECT($AJ$1&\"!A4\"))","v":""},"G",{"$nulls":8},{"$f":"IF(Q7=\"\",\"\",T6+1)","v":""},{"$nulls":3},{"$f":"IF(U7=\"\",\"\",X6+1)","v":""},{"$nulls":3},{"$f":"IF(AA7=\"\",0,VLOOKUP(AA7,Daten!$B$2:$C$11,2,FALSE))","v":{"v":0,"d":"0.0"}},null,null,3]
[{"$nulls":8},"Ligue/ Lega",{"$f":"IF(INDIRECT($AJ$1&\"!A5\")=\"\",\"\",INDIRECT($AJ$1&\"!A5\"))","v":""},"G",{"$nulls":8},{"$f":"IF(Q8=\"\",\"\",T7+1)","v":""},{"$nulls":3},"",{"$nulls":3},{"$f":"IF(AA8=\"\",0,VLOOKUP(AA8,Daten!$B$2:$C$11,2,FALSE))","v":{"v":0,"d":"0.0"}},null,null,4,{"$nulls":4},"Overtime?"]
{"$rows_left_out":49}
{"sheet":"Zusatzblatt","index":7,"n_rows":58,"n_cols":27,"rows_kept":58,"merged":[[0,0,1,13],[0,25,0,26],[2,0,2,13],[7,1,7,5],[7,7,7,9],[7,12,7,13],[7,17,8,20],[7,22,11,22],[8,1,8,5],[8,7,8,9],[8,12,8,13],[9,1,9,5],[9,7,9,13],[9,17,9,18],[10,1,10,5],[10,7,10,13],[10,17,11,20],[11,2,11,3],[13,2,13,20],[14,2,14,10],[14,13,14,20],[15,2,15,10],[15,13,15,20],[16,2,16,10],[16,13,16,18],[16,19,16,20],[17,2,17,10],[17,13,17,20],[18,0,18,2],[18,3,18,10],[18,13,18,20],[19,0,19,2],[19,3,19,10],[19,13,19,20],[20,0,20,2],[20,3,20,10],[20,13,20,20],[21,0,21,2],[21,3,21,10],[21,13,21,20],[22,0,22,2],[22,3,22,10],[22,13,22,20],[23,0,23,2],[23,3,23,10],[23,13,23,20],[24,2,24,10],[24,14,24,20],[25,2,25,10],[25,14,25,20],[27,2,27,20],[28,2,28,10],[28,13,28,20],[29,2,29,10],[29,13,29,20],[30,2,30,10],[30,13,30,20],[31,2,31,10],[31,13,31,20],[32,2,32,10],[32,13,32,20],[33,2,33,6],[33,7,33,11],[33,13,33,20],[34,2,34,10],[34,13,34,20],[35,2,35,10],[35,13,35,20],[36,2,36,10],[36,13,36,20],[38,2,38,20],[39,2,39,5],[39,8,39,9],[39,12,39,13],[39,14,39,15],[40,2,40,15],[41,5,41,7],[41,8,41,15],[41,16,41,19],[42,2,42,3],[42,5,42,7],[42,8,42,15],[42,16,42,19],[43,2,43,3],[43,5,43,7],[43,8,43,15],[43,16,43,19],[44,2,44,3],[44,5,44,7],[44,8,44,15],[44,16,44,19],[46,2,46,20],[47,2,47,20],[51,7,52,12],[51,17,52,20],[53,7,53,12],[53,17,53,20],[55,2,56,5],[55,7,56,12],[55,17,56,20],[57,2,57,5],[57,7,57,12],[57,17,57,20]]}
["Deutscher Rollsport und Inline Verband e.V.",{"$nulls":24},"Zum Schluss!"]
[]
["Inline-Skaterhockey Deutschland (ISHD)"]
[]
[]
[{"$nulls":25},"Version:","22.3.2024_Saison2024"]
[]
[null,{"$f":"IF(Spielbericht!D13=\"\",\"\",Spielbericht!D13)","v":"a-Heim"},{"$nulls":5},{"$f":"IF(Spielbericht!I9=\"\",\"\",Spielbericht!I9)","v":"AB"},{"$nulls":4},{"$f":"IF(Spielbericht!H13=\"\",\"\",Spielbericht!H13)","v":""},{"$nulls":4},"e-Zusatzblatt zum Spielbericht",{"$nulls":4},{"$f":"YEAR(TODAY())","v":2024}]
{"$rows_left_out":51}
{"sheet":"Strafzeitencodes","index":8,"n_rows":0,"n_cols":0,"rows_kept":0}

{"sheet":"Penaltyschießen","index":9,"n_rows":54,"n_cols":25,"rows_kept":54,"merged":[[0,0,1,13],[0,14,2,19],[0,20,6,20],[0,23,0,24],[2,0,2,13],[3,0,54,0],[3,1,6,19],[5,23,5,24],[7,1,7,5],[7,6,8,6],[7,7,7,8],[7,9,8,9],[7,11,7,13],[7,14,11,14],[7,15,8,19],[7,20,11,20],[8,1,8,5],[8,7,8,8],[8,11,8,13],[9,1,9,5],[9,6,9,7],[9,8,9,13],[9,16,9,19],[10,1,10,5],[10,6,10,7],[10,8,10,13],[10,15,11,19],[11,2,11,3],[11,10,11,13],[12,2,12,19],[12,20,54,20],[13,2,13,5],[13,6,13,11],[13,13,13,14],[13,15,13,19],[14,2,14,5],[14,6,14,11],[14,13,14,14],[14,15,14,19],[15,2,15,19],[16,2,16,19],[17,2,17,19],[18,2,19,2],[18,3,19,4],[18,5,19,7],[18,8,20,10],[18,11,20,11],[18,12,19,12],[18,13,19,13],[18,14,19,16],[18,17,20,19],[20,3,20,4],[20,5,20,7],[20,14,20,16],[21,2,21,19],[22,2,22,19],[23,2,24,2],[23,3,24,3],[23,5,24,7],[23,8,23,10],[23,11,27,11],[23,12,24,12],[23,13,24,13],[23,14,24,16],[23,17,23,19],[24,9,27,9],[24,18,27,18],[25,3,25,4],[25,5,25,7],[25,14,25,16],[26,3,26,4],[26,5,26,7],[26,14,26,16],[27,3,27,4],[27,5,27,7],[27,14,27,16],[28,2,28,19],[29,2,29,19],[30,2,31,2],[30,3,31,4],[30,5,31,7],[30,8,30,10],[30,11,33,11],[30,12,31,12],[30,13,31,13],[30,14,31,16],[30,17,30,19],[31,9,33,9],[31,18,33,18],[32,3,32,4],[32,5,32,7],[32,14,32,16],[33,3,33,4],[33,5,33,7],[33,14,33,16],[34,2,34,19],[35,2,35,19],[36,2,37,2],[36,3,37,4],[36,5,37,7],[36,8,36,10],[36,11,42,11],[36,12,37,12],[36,13,37,13],[36,14,37,16],[36,17,36,19],[37,9,42,9],[37,18,42,18],[38,3,38,4],[38,5,38,7],[38,14,38,16],[39,3,39,4],[39,5,39,7],[39,14,39,16],[40,3,40,4],[40,5,40,7],[40,14,40,16],[41,3,41,4],[41,5,41,7],[41,14,41,16],[42,3,42,4],[42,5,42,7],[42,14,42,16],[43,2,44,19],[45,2,45,19],[46,2,49,3],[46,4,49,19],[50,2,50,19],[51,2,53,6],[51,7,52,13],[51,14,53,14],[51,15,52,19],[53,7,53,13],[53,15,53,19],[54,2,54,19]]}
["Deutscher Rollsport und Inline Verband e.V.",{"$nulls":22},"Zum Schluss!"]
[]
["Inline-Skaterhockey Deutschland (ISHD)"]
[]
[]
[{"$nulls":23},"Fehler?"]
[]
[null,{"$f":"IF(Spielbericht!D13=\"\",\"\",Spielbericht!D13)","v":"a-Heim"},{"$nulls":5},{"$f":"IF(Spielbericht!I9=\"\",\"\",Spielbericht!I9)","v":"AB"},{"$nulls":3},{"$f":"IF(Spielbericht!H13=\"\",\"\",Spielbericht!H13)","v":""},{"$nulls":3},"e-Penaltyschießen",{"$nulls":4},{"$f":"YEAR(TODAY())","v":2024}]
{"$rows_left_out":47}
{"sheet":"BesondereVorkommnisse","index":10,"n_rows":61,"n_cols":23,"rows_kept":61,"merged":[[0,0,1,11],[0,21,0,22],[2,0,2,11],[4,21,4,22],[7,1,7,5],[7,7,7,8],[7,10,7,11],[7,13,7,17],[7,18,12,18],[8,1,8,5],[8,7,8,8],[8,10,8,11],[8,13,12,17],[10,1,10,5],[10,6,10,7],[10,8,10,11],[11,1,11,5],[11,8,11,11],[14,1,14,11],[14,15,14,16],[16,1,16,8],[16,10,16,11],[16,13,16,17],[17,1,17,8],[17,10,17,11],[17,13,17,17],[19,1,19,8],[19,10,19,11],[19,13,19,17],[20,1,20,8],[20,10,20,11],[20,13,20,17],[22,1,22,8],[22,10,22,11],[22,13,22,17],[23,1,23,8],[23,10,23,11],[23,13,23,17],[25,1,25,17],[27,1,27,8],[27,10,27,11],[27,13,27,14],[27,16,27,17],[28,1,29,8],[28,10,29,11],[28,13,29,14],[28,16,29,17],[31,1,31,17],[33,1,33,12],[34,1,34,5],[34,6,34,12],[35,3,35,12],[36,3,36,12],[37,3,37,12],[40,1,48,17],[50,1,50,5],[50,7,50,8],[50,10,50,11],[50,14,50,17],[52,7,55,11],[52,13,53,17],[54,13,55,17],[57,7,58,10],[57,13,58,17],[59,7,59,10],[59,13,59,17],[60,7,60,17]]}
["Deutscher Rollsport und Inline Verband e.V.",{"$nulls":20},"Zum Schluss!"]
[]
["Inline-Skaterhockey Deutschland (ISHD)"]
[]
[{"$nulls":21},"BV kopieren?"]
[]
[]
[null,{"$f":"IF(Spielbericht!D13=\"\",\"\",Spielbericht!D13)","v":"a-Heim"},{"$nulls":5},{"$f":"IF(Spielbericht!I9=\"\",\"\",Spielbericht!I9)","v":"AB"},null,null,{"$f":"IF(Spielbericht!H13=\"\",\"\",Spielbericht!H13)","v":""},null,null,"e-Besondere Vorkommnisse",{"$nulls":4},{"$f":"YEAR(TODAY())","v":2024}]
{"$rows_left_out":42}