{"text_format":"3","workbook":"xlsx","n_sheets":11,"sheets":["Daten","Setup","Gesamt","Club1","Club2","Spielbericht","Zusatzblatt","Strafzeitencodes","Adressliste Staffelleiter","Penaltyschießen","BesondereVorkommnisse"],"not_rendered":{"images":8,"macros":1,"defined_names":10},"read":"whole","date_system":"1900"}

{"sheet":"Daten","index":0,"n_rows":26,"n_cols":5,"rows_kept":26,"hidden":true}
["Codes","Strafen","Count Strafe","Spielzeiten","Verlängerung"]
["A",2,2,{"v":1200,"d":"12:00"},{"v":500,"d":"05:00"}]
["B",5,5,{"v":1500,"d":"15:00"},{"v":1000,"d":"10:00"}]
["C",10,10,{"v":2000,"d":"20:00"}]
["D","5+GM",5]
["E","10+GM",10]
["F","GM"]
["G","MP"]
["H"]
["I"]
{"$rows_left_out":17}
{"sheet":"Setup","index":1,"n_rows":17,"n_cols":11,"rows_kept":17,"merged":[[0,0,0,7],[0,10,0,11],[10,0,10,3],[11,0,11,1],[11,2,11,3]]}
["Setup zum Spiel",{"$nulls":9},"Zum Schluss!"]
[]
["Spielort","Düsseldorf",null,null,"Passnummer","Verein","Nachname","Vorname"]
["Datum",null,null,"Zeitnehmer 1"]
["Startzeit",null,null,"Zeitnehmer 2"]
["Endzeit",null,null,"Schiedsrichter 1"]
["Spielnummer*",null,null,"Schiedsrichter 2"]
["Spieltyp","Meisterschaft",null,"Tech. Direktor"]
["Zuschauer"]
[]
{"$rows_left_out":8}
{"sheet":"Gesamt","index":2,"n_rows":37,"n_cols":6,"rows_kept":37,"hidden":true}
["Passnummer","Trikotnummer","Funktion","Nachname","Vorname","Verein"]
[{"$f":"IF(Club1!E8=\"\",\"\",Club1!E8)","v":""},{"$f":"IF(Club1!A8=\"\",\"\",Club1!A8)","v":""},{"$f":"IF(Club1!B8=\"\",\"\",Club1!B8)","v":"C"},{"$f":"IF(Club1!C8=\"\",\"\",Club1!C8)","v":""},{"$f":"IF(Club1!D8=\"\",\"\",Club1!D8)","v":""},{"$f":"IF(Club1!$C$1=\"\",\"\",Club1!$C$1)","v":""}]
[{"$f":"IF(Club1!E9=\"\",\"\",Club1!E9)","v":""},{"$f":"IF(Club1!A9=\"\",\"\",Club1!A9)","v":""},{"$f":"IF(Club1!B9=\"\",\"\",Club1!B9)","v":"A"},{"$f":"IF(Club1!C9=\"\",\"\",Club1!C9)","v":""},{"$f":"IF(Club1!D9=\"\",\"\",Club1!D9)","v":""},{"$f":"IF(Club1!$C$1=\"\",\"\",Club1!$C$1)","v":""}]
[{"$f":"IF(Club1!E10=\"\",\"\",Club1!E10)","v":""},{"$f":"IF(Club1!A10=\"\",\"\",Club1!A10)","v":""},{"$f":"IF(Club1!B10=\"\",\"\",Club1!B10)","v":"G"},{"$f":"IF(Club1!C10=\"\",\"\",Club1!C10)","v":""},{"$f":"IF(Club1!D10=\"\",\"\",Club1!D10)","v":""},{"$f":"IF(Club1!$C$1=\"\",\"\",Club1!$C$1)","v":""}]
[{"$f":"IF(Club1!E11=\"\",\"\",Club1!E11)","v":""},{"$f":"IF(Club1!A11=\"\",\"\",Club1!A11)","v":""},{"$f":"IF(Club1!B11=\"\",\"\",Club1!B11)","v":"G"},{"$f":"IF(Club1!C11=\"\",\"\",Club1!C11)","v":""},{"$f":"IF(Club1!D11=\"\",\"\",Club1!D11)","v":""},{"$f":"IF(Club1!$C$1=\"\",\"\",Club1!$C$1)","v":""}]
[{"$f":"IF(Club1!E12=\"\",\"\",Club1!E12)","v":""},{"$f":"IF(Club1!A12=\"\",\"\",Club1!A12)","v":""},{"$f":"IF(Club1!B12=\"\",\"\",Club1!B12)","v":"F"},{"$f":"IF(Club1!C12=\"\",\"\",Club1!C12)","v":""},{"$f":"IF(Club1!D12=\"\",\"\",Club1!D12)","v":""},{"$f":"IF(Club1!$C$1=\"\",\"\",Club1!$C$1)","v":""}]
[{"$f":"IF(Club1!E13=\"\",\"\",Club1!E13)","v":""},{"$f":"IF(Club1!A13=\"\",\"\",Club1!A13)","v":""},{"$f":"IF(Club1!B13=\"\",\"\",Club1!B13)","v":"F"},{"$f":"IF(Club1!C13=\"\",\"\",Club1!C13)","v":""},{"$f":"IF(Club1!D13=\"\",\"\",Club1!D13)","v":""},{"$f":"IF(Club1!$C$1=\"\",\"\",Club1!$C$1)","v":""}]
[{"$f":"IF(Club1!E14=\"\",\"\",Club1!E14)","v":""},{"$f":"IF(Club1!A14=\"\",\"\",Club1!A14)","v":""},{"$f":"IF(Club1!B14=\"\",\"\",Club1!B14)","v":"F"},{"$f":"IF(Club1!C14=\"\",\"\",Club1!C14)","v":""},{"$f":"IF(Club1!D14=\"\",\"\",Club1!D14)","v":""},{"$f":"IF(Club1!$C$1=\"\",\"\",Club1!$C$1)","v":""}]
[{"$f":"IF(Club1!E15=\"\",\"\",Club1!E15)","v":""},{"$f":"IF(Club1!A15=\"\",\"\",Club1!A15)","v":""},{"$f":"IF(Club1!B15=\"\",\"\",Club1!B15)","v":"F"},{"$f":"IF(Club1!C15=\"\",\"\",Club1!C15)","v":""},{"$f":"IF(Club1!D15=\"\",\"\",Club1!D15)","v":""},{"$f":"IF(Club1!$C$1=\"\",\"\",Club1!$C$1)","v":""}]
[{"$f":"IF(Club1!E16=\"\",\"\",Club1!E16)","v":""},{"$f":"IF(Club1!A16=\"\",\"\",Club1!A16)","v":""},{"$f":"IF(Club1!B16=\"\",\"\",Club1!B16)","v":"F"},{"$f":"IF(Club1!C16=\"\",\"\",Club1!C16)","v":""},{"$f":"IF(Club1!D16=\"\",\"\",Club1!D16)","v":""},{"$f":"IF(Club1!$C$1=\"\",\"\",Club1!$C$1)","v":""}]
{"$rows_left_out":28}
{"sheet":"Club1","index":3,"n_rows":27,"n_cols":9,"rows_kept":27,"merged":[[0,0,0,1],[0,2,0,3],[1,0,1,1],[1,2,1,4]]}
["Mannschaft 1:",{"$nulls":4},"Spieleranzahl:",{"$f":"SUM(I8:I25)","v":0}]
["Liga:"]
[]
[null,"Coach","Nachname","Vorname"]
[]
[]
["Trikotnummer","Funktion","Nachname","Vorname","Passnummer"]
[null,"C",{"$nulls":6},{"$f":"IF(OR(Team_A45[[#This Row],[Trikotnummer]]=\"\",Team_A45[[#This Row],[Nachname]]=\"\",Team_A45[[#This Row],[Vorname]]=\"\",Team_A45[[#This Row],[Passnummer]]=\"\"),0,1)","v":0}]
[null,"A",{"$nulls":6},{"$f":"IF(OR(Team_A45[[#This Row],[Trikotnummer]]=\"\",Team_A45[[#This Row],[Nachname]]=\"\",Team_A45[[#This Row],[Vorname]]=\"\",Team_A45[[#This Row],[Passnummer]]=\"\"),0,1)","v":0}]
[null,"G",{"$nulls":6},{"$f":"IF(OR(Team_A45[[#This Row],[Trikotnummer]]=\"\",Team_A45[[#This Row],[Nachname]]=\"\",Team_A45[[#This Row],[Vorname]]=\"\",Team_A45[[#This Row],[Passnummer]]=\"\"),0,1)","v":0}]
{"$rows_left_out":18}
{"sheet":"Club2","index":4,"n_rows":27,"n_cols":9,"rows_kept":27,"merged":[[0,0,0,1],[0,2,0,3],[1,0,1,1],[1,2,1,4]]}
["Mannschaft 2:",{"$nulls":4},"Spieleranzahl:",{"$f":"SUM(I8:I25)","v":0}]
["Liga:"]
[]
[null,"Coach","Nachname","Vorname"]
[]
[]
["Trikotnummer","Funktion","Nachname","Vorname","Passnummer"]
[null,"C",{"$nulls":6},{"$f":"IF(OR(Team_A4[[#This Row],[Trikotnummer]]=\"\",Team_A4[[#This Row],[Nachname]]=\"\",Team_A4[[#This Row],[Vorname]]=\"\",Team_A4[[#This Row],[Passnummer]]=\"\"),0,1)","v":0}]
[null,"A",{"$nulls":6},{"$f":"IF(OR(Team_A4[[#This Row],[Trikotnummer]]=\"\",Team_A4[[#This Row],[Nachname]]=\"\",Team_A4[[#This Row],[Vorname]]=\"\",Team_A4[[#This Row],[Passnummer]]=\"\"),0,1)","v":0}]
[null,"G",{"$nulls":6},{"$f":"IF(OR(Team_A4[[#This Row],[Trikotnummer]]=\"\",Team_A4[[#This Row],[Nachname]]=\"\",Team_A4[[#This Row],[Vorname]]=\"\",Team_A4[[#This Row],[Passnummer]]=\"\"),0,1)","v":0}]
{"$rows_left_out":18}
{"sheet":"Spielbericht","index":5,"n_rows":56,"n_cols":40,"rows_kept":56,"merged":[[0,0,7,1],[0,2,5,6],[0,7,0,8],[0,9,0,14],[0,15,0,22],[0,23,0,27],[0,30,0,31],[1,7,3,7],[1,8,3,13],[1,14,3,14],[1,15,3,15],[1,16,3,16],[1,17,3,17],[1,18,3,18],[1,19,3,19],[1,20,3,20],[1,21,3,21],[1,22,3,22],[1,23,3,23],[1,24,3,24],[1,25,3,25],[1,26,3,26],[1,27,3,27],[1,28,3,28],[2,35,3,35],[4,9,4,13],[5,9,5,13],[6,2,7,5],[6,6,7,6],[8,0,9,1],[8,2,9,5],[8,6,9,6],[8,9,8,13],[9,9,9,13],[10,0,11,1],[10,2,11,5],[10,6,11,6],[10,9,10,13],[11,9,11,13],[12,0,13,0],[12,1,13,3],[12,4,13,4],[12,5,13,6],[12,9,12,13],[12,30,12,31],[13,9,13,13],[14,0,15,0],[14,1,15,1],[14,2,15,2],[14,3,15,3],[14,4,15,4],[14,5,15,6],[14,9,14,13],[15,9,15,13],[16,0,16,2],[16,4,16,5],[16,9,16,13],[17,0,17,2],[17,4,17,5],[17,9,17,13],[18,0,18,2],[18,4,18,5],[18,9,18,13],[19,0,20,0],[19,1,20,2],[19,3,20,4],[19,5,20,6],[19,9,19,13],[20,9,20,13],[21,0,23,0],[21,1,23,2],[21,3,23,4],[21,5,23,6],[21,9,21,13],[22,7,26,8],[22,9,24,9],[22,10,24,13],[22,14,24,14],[22,15,23,15],[22,16,23,16],[22,17,23,17],[22,18,23,18],[22,19,23,19],[22,20,23,20],[22,21,23,21],[22,22,23,22],[22,23,23,23],[22,24,23,24],[22,25,23,25],[22,26,23,26],[22,27,23,27],[22,28,23,28],[24,0,26,0],[24,1,26,2],[24,3,26,4],[24,5,26,6],[24,15,25,15],[24,16,25,16],[24,17,25,17],[24,18,25,18],[24,19,25,20],[24,21,25,22],[24,23,25,23],[24,24,25,24],[24,25,25,25],[24,26,25,26],[24,27,25,27],[24,28,25,28],[25,9,26,9],[25,10,26,14],[26,15,26,18],[26,23,26,25],[27,0,29,0],[27,1,29,2],[27,3,29,4],[27,5,29,6],[27,7,29,8],[27,9,29,14],[27,15,29,22],[27,23,29,27],[30,0,32,0],[30,1,32,2],[30,3,32,4],[30,5,32,6],[30,7,32,7],[30,8,32,13],[30,14,32,14],[30,15,32,15],[30,16,32,16],[30,17,32,17],[30,18,32,18],[30,19,32,19],[30,20,32,20],[30,21,32,21],[30,22,32,22],[30,23,32,23],[30,24,32,24],[30,25,32,25],[30,26,32,26],[30,27,32,27],[30,28,32,28],[31,35,32,35],[33,0,34,0],[33,1,34,2],[33,3,34,4],[33,5,34,6],[33,9,33,13],[33,37,34,37],[33,38,34,38],[34,9,34,13],[35,0,35,6],[35,37,36,37],[35,38,36,38],[36,0,37,0],[36,1,37,3],[36,4,37,6],[37,9,37,13],[37,37,38,37],[37,38,38,38],[38,1,38,2],[38,5,38,6],[38,9,38,13],[39,0,40,0],[39,1,40,2],[39,3,40,3],[39,4,40,4],[39,5,40,6],[39,9,39,13],[39,37,40,37],[39,38,40,38],[40,9,40,13],[41,0,42,0],[41,1,42,2],[41,3,42,3],[41,4,41,6],[41,9,41,13],[41,37,42,37],[41,38,42,38],[42,4,42,6],[42,9,42,13],[43,0,44,0],[43,1,44,2],[43,3,44,3],[43,4,45,6],[43,9,43,13],[44,9,44,13],[45,0,46,0],[45,1,46,2],[45,3,46,3],[45,9,45,13],[46,4,48,6],[46,9,46,13],[47,0,48,0],[47,1,48,2],[47,3,48,3],[47,9,47,13],[48,9,48,13],[49,0,54,6],[49,9,49,13],[50,9,50,13],[51,7,55,8],[51,9,53,9],[51,10,53,13],[51,14,53,14],[51,15,52,15],[51,16,52,16],[51,17,52,17],[51,18,52,18],[51,19,52,19],[51,20,52,20],[51,21,52,21],[51,22,52,22],[51,23,52,23],[51,24,52,24],[51,25,52,25],[51,26,52,26],[51,27,52,27],[51,28,52,28],[53,15,54,15],[53,16,54,16],[53,17,54,17],[53,18,54,18],[53,19,54,20],[53,21,54,22],[53,23,54,23],[53,24,54,24],[53,25,54,25],[53,26,54,26],[53,27,54,27],[53,28,54,28],[54,9,55,9],[54,10,55,14],[55,0,55,5],[55,15,55,18],[55,23,55,25]]}
[null,null,"Game Sheet Inline Skater Hockey                        Spielbericht Inline Skaterhockey                               ",{"$nulls":4},"Club 1",null,{"$f":"C9","v":""},{"$nulls":5},"Goals / Tore",{"$nulls":7},"Penalties / Strafen",{"$nulls":6},"Spielbeginn / -ende",{"$nulls":5},"Club1","Club2"]
[{"$nulls":7},"No.\nNr.","Surname, Forname\nName, Vorname",{"$nulls":5},"License No.\nPass-Nr.","Time\nZeit","G","A","T","Time\nZeit","G","A","T","Time\nZeit","No.\nNr.","min.\nMin.","Off\nEnde","code\nCode","Nummer\nStrafzeit",{"$nulls":7},"Drittel 1",{"$f":"Setup!B13","v":2000}]
[{"$nulls":35},"latest Endtime","Drittel 2",{"$f":"AL2*2","v":4000}]
[{"$nulls":36},"Drittel 3",{"$f":"AL2*3","v":6000}]
[{"$nulls":7},{"$f":"IF(INDIRECT($AK$1&\"!a8\")=\"\",\"\",INDIRECT($AK$1&\"!a8\"))","v":""},"C",{"$f":"IF(H5=\"\",\"\",CONCATENATE(IF(INDIRECT($AK$1&\"!c8\")=\"\",\"\",INDIRECT($AK$1&\"!c8\")),\", \",IF(INDIRECT($AK$1&\"!d8\")=\"\",\"\",INDIRECT($AK$1&\"!d8\"))))","v":""},{"$nulls":4},{"$f":"IF(INDIRECT($AK$1&\"!e8\")=\"\",\"\",INDIRECT($AK$1&\"!e8\"))","v":""},{"$nulls":3},{"$f":"IF(TRIM(P5)=\"\",\"\",1)","v":""},{"$nulls":3},{"$f":"IF(TRIM(T5)=\"\",\"\",S25+1)","v":""},{"$nulls":5},1,{"$nulls":5},{"$f":"IF(Z5=\"\",0,VLOOKUP(Z5,Daten!$B$2:$C$11,2,FALSE))","v":{"v":0,"d":"0.0"}},{"$f":"X5+AI5*100","v":{"v":0,"d":"00:00"}},"Overtime",{"$f":"AL4+Setup!D13*Setup!D14","v":6000}]
[{"$nulls":7},{"$f":"IF(INDIRECT($AK$1&\"!a9\")=\"\",\"\",INDIRECT($AK$1&\"!a9\"))","v":""},"A",{"$f":"IF(H6=\"\",\"\",CONCATENATE(IF(INDIRECT($AK$1&\"!c9\")=\"\",\"\",INDIRECT($AK$1&\"!c9\")),\", \",IF(INDIRECT($AK$1&\"!d9\")=\"\",\"\",INDIRECT($AK$1&\"!d9\"))))","v":""},{"$nulls":4},{"$f":"IF(INDIRECT($AK$1&\"!e9\")=\"\",\"\",INDIRECT($AK$1&\"!e9\"))","v":""},{"$nulls":3},{"$f":"IF(TRIM(P6)=\"\",\"\",S5+1)","v":""},{"$nulls":3},{"$f":"IF(TRIM(T6)=\"\",\"\",W5+1)","v":""},{"$nulls":5},2,{"$nulls":5},{"$f":"IF(Z6=\"\",0,VLOOKUP(Z6,Daten!$B$2:$C$11,2,FALSE))","v":{"v":0,"d":"0.0"}},{"$f":"X6+AI6*100","v":{"v":0,"d":"00:00"}},"AnzahlDrittel",{"$f":"Setup!B14","v":3}]
[null,null,"Team\nMannschaft",{"$nulls":3},"League\nLiga",{"$f":"IF(INDIRECT($AK$1&\"!a10\")=\"\",\"\",INDIRECT($AK$1&\"!a10\"))","v":""},"G",{"$f":"IF(H7=\"\",\"\",CONCATENATE(IF(INDIRECT($AK$1&\"!c10\")=\"\",\"\",INDIRECT($AK$1&\"!c10\")),\", \",IF(INDIRECT($AK$1&\"!d10\")=\"\",\"\",INDIRECT($AK$1&\"!d10\"))))","v":""},1,2,3,"OT",{"$f":"IF(INDIRECT($AK$1&\"!e10\")=\"\",\"\",INDIRECT($AK$1&\"!e10\"))","v":""},{"$nulls":3},{"$f":"IF(TRIM(P7)=\"\",\"\",S6+1)","v":""},{"$nulls":3},"",{"$nulls":5},3,{"$nulls":5},{"$f":"IF(Z7=\"\",0,VLOOKUP(Z7,Daten!$B$2:$C$11,2,FALSE))","v":{"v":0,"d":"0.0"}},{"v":0,"d":"00:00"},"AnzahlOvertime",{"$f":"Setup!D14","v":0},{"$f":"AL7+AL6","v":3}]
[{"$nulls":7},{"$f":"IF(INDIRECT($AK$1&\"!a11\")=\"\",\"\",INDIRECT($AK$1&\"!a11\"))","v":""},"G",{"$f":"IF(H8=\"\",\"\",CONCATENATE(IF(INDIRECT($AK$1&\"!c11\")=\"\",\"\",INDIRECT($AK$1&\"!c11\")),\", \",IF(INDIRECT($AK$1&\"!d11\")=\"\",\"\",INDIRECT($AK$1&\"!d11\"))))","v":""},1,2,3,"OT",{"$f":"IF(INDIRECT($AK$1&\"!e11\")=\"\",\"\",INDIRECT($AK$1&\"!e11\"))","v":""},{"$nulls":3},"",{"$nulls":3},"",{"$nulls":5},4,{"$nulls":5},{"$f":"IF(Z8=\"\",0,VLOOKUP(Z8,Daten!$B$2:$C$11,2,FALSE))","v":{"v":0,"d":"0.0"}},{"v":0,"d":"00:00"},"Overtime?",{"$f":"IF(AL4=AL5,0,1)","v":0}]
["CLUB 1",null,{"$f":"IF(INDIRECT($AK$1&\"!c1\")=\"\",\"\",INDIRECT($AK$1&\"!c1\")&\" \"&INDIRECT($AK$1&\"!e1\"))","v":""},{"$nulls":3},{"$f":"IF(C9=\"\",\"\",UPPER(SUBSTITUTE(INDIRECT(AK1&\"!c2\"),\" \",\"\")))","v":""},{"$f":"IF(INDIRECT($AK$1&\"!a12\")=\"\",\"\",INDIRECT($AK$1&\"!a12\"))","v":""},"F",{"$f":"IF(H9=\"\",\"\",CONCATENATE(IF(INDIRECT($AK$1&\"!c12\")=\"\",\"\",INDIRECT($AK$1&\"!c12\")),\", \",IF(INDIRECT($AK$1&\"!d12\")=\"\",\"\",INDIRECT($AK$1&\"!d12\"))))","v":""},{"$f":"IF(I9=\"\",\"\",CONCATENATE(IF(INDIRECT($AK$1&\"!c12\")=\"\",\"\",INDIRECT($AK$1&\"!c12\")),\", \",IF(INDIRECT($AK$1&\"!d12\")=\"\",\"\",INDIRECT($AK$1&\"!d12\"))))","v":", "},{"$f":"IF(J9=\"\",\"\",CONCATENATE(IF(INDIRECT($AK$1&\"!c12\")=\"\",\"\",INDIRECT($AK$1&\"!c12\")),\", \",IF(INDIRECT($AK$1&\"!d12\")=\"\",\"\",INDIRECT($AK$1&\"!d12\"))))","v":""},{"$f":"IF(K9=\"\",\"\",CONCATENATE(IF(INDIRECT($AK$1&\"!c12\")=\"\",\"\",INDIRECT($AK$1&\"!c12\")),\", \",IF(INDIRECT($AK$1&\"!d12\")=\"\",\"\",INDIRECT($AK$1&\"!d12\"))))","v":", "},{"$f":"IF(L9=\"\",\"\",CONCATENATE(IF(INDIRECT($AK$1&\"!c12\")=\"\",\"\",INDIRECT($AK$1&\"!c12\")),\", \",IF(INDIRECT($AK$1&\"!d12\")=\"\",\"\",INDIRECT($AK$1&\"!d12\"))))","v":""},{"$f":"IF(INDIRECT($AK$1&\"!e12\")=\"\",\"\",INDIRECT($AK$1&\"!e12\"))","v":""},{"$nulls":3},"",{"$nulls":3},"",{"$nulls":5},5,{"$nulls":5},{"$f":"IF(Z9=\"\",0,VLOOKUP(Z9,Daten!$B$2:$C$11,2,FALSE))","v":{"v":0,"d":"0.0"}},{"v":0,"d":"00:00"},"Heim 1",{"$f":"IF(MAX(P5:P26)>$AL$4,\"WAHR\",\"FALSCH\")","v":"FALSCH"},{"$f":"_xlfn.IFNA(MATCH(\"WAHR\",AL9:AL16,0),0)","v":0}]
[{"$nulls":7},{"$f":"IF(INDIRECT($AK$1&\"!a13\")=\"\",\"\",INDIRECT($AK$1&\"!a13\"))","v":""},"F",{"$f":"IF(H10=\"\",\"\",CONCATENATE(IF(INDIRECT($AK$1&\"!c13\")=\"\",\"\",INDIRECT($AK$1&\"!c13\")),\", \",IF(INDIRECT($AK$1&\"!d13\")=\"\",\"\",INDIRECT($AK$1&\"!d13\"))))","v":""},{"$f":"IF(I10=\"\",\"\",CONCATENATE(IF(INDIRECT($AK$1&\"!c13\")=\"\",\"\",INDIRECT($AK$1&\"!c13\")),\", \",IF(INDIRECT($AK$1&\"!d13\")=\"\",\"\",INDIRECT($AK$1&\"!d13\"))))","v":", "},{"$f":"IF(J10=\"\",\"\",CONCATENATE(IF(INDIRECT($AK$1&\"!c13\")=\"\",\"\",INDIRECT($AK$1&\"!c13\")),\", \",IF(INDIRECT($AK$1&\"!d13\")=\"\",\"\",INDIRECT($AK$1&\"!d13\"))))","v":""},{"$f":"IF(K10=\"\",\"\",CONCATENATE(IF(INDIRECT($AK$1&\"!c13\")=\"\",\"\",INDIRECT($AK$1&\"!c13\")),\", \",IF(INDIRECT($AK$1&\"!d13\")=\"\",\"\",INDIRECT($AK$1&\"!d13\"))))","v":", "},{"$f":"IF(L10=\"\",\"\",CONCATENATE(IF(INDIRECT($AK$1&\"!c13\")=\"\",\"\",INDIRECT($AK$1&\"!c13\")),\", \",IF(INDIRECT($AK$1&\"!d13\")=\"\",\"\",INDIRECT($AK$1&\"!d13\"))))","v":""},{"$f":"IF(INDIRECT($AK$1&\"!e13\")=\"\",\"\",INDIRECT($AK$1&\"!e13\"))","v":""},{"$nulls":3},"",{"$nulls":3},"",{"$nulls":5},6,{"$nulls":5},{"$f":"IF(Z10=\"\",0,VLOOKUP(Z10,Daten!$B$2:$C$11,2,FALSE))","v":{"v":0,"d":"0.0"}},{"v":0,"d":"00:00"},"Heim 2",{"$f":"IF(MAX(T5:T24)>$AL$4,\"WAHR\",\"FALSCH\")","v":"FALSCH"}]
{"$rows_left_out":47}
{"sheet":"Zusatzblatt","index":6,"n_rows":58,"n_cols":27,"rows_kept":58,"merged":[[0,0,1,13],[0,25,0,26],[2,0,2,13],[7,1,7,5],[7,7,7,9],[7,12,7,13],[7,17,8,20],[7,22,11,22],[8,1,8,5],[8,7,8,9],[8,12,8,13],[9,1,9,5],[9,7,9,13],[9,17,9,18],[10,1,10,5],[10,7,10,13],[10,17,11,20],[11,2,11,3],[13,2,13,20],[14,2,14,10],[14,13,14,20],[15,2,15,10],[15,13,15,20],[16,2,16,10],[16,13,16,18],[16,19,16,20],[17,2,17,10],[17,13,17,20],[18,0,18,2],[18,3,18,10],[18,13,18,20],[19,0,19,2],[19,3,19,10],[19,13,19,20],[20,0,20,2],[20,3,20,10],[20,13,20,20],[21,0,21,2],[21,3,21,10],[21,13,21,20],[22,0,22,2],[22,3,22,10],[22,13,22,20],[23,0,23,2],[23,3,23,10],[23,13,23,20],[24,2,24,10],[24,14,24,20],[25,2,25,10],[25,14,25,20],[27,2,27,20],[28,2,28,10],[28,13,28,20],[29,2,29,10],[29,13,29,20],[30,2,30,10],[30,13,30,20],[31,2,31,10],[31,13,31,20],[32,2,32,10],[32,13,32,20],[33,2,33,6],[33,7,33,11],[33,13,33,20],[34,2,34,10],[34,13,34,20],[35,2,35,10],[35,13,35,20],[36,2,36,10],[36,13,36,20],[38,2,38,20],[39,2,39,5],[39,8,39,9],[39,12,39,13],[39,14,39,15],[40,2,40,15],[41,5,41,7],[41,8,41,15],[41,16,41,19],[42,2,42,3],[42,5,42,7],[42,8,42,15],[42,16,42,19],[43,2,43,3],[43,5,43,7],[43,8,43,15],[43,16,43,19],[44,2,44,3],[44,5,44,7],[44,8,44,15],[44,16,44,19],[46,2,46,20],[47,2,47,20],[51,7,52,12],[51,17,52,20],[53,7,53,12],[53,17,53,20],[55,2,56,5],[55,7,56,12],[55,17,56,20],[57,2,57,5],[57,7,57,12],[57,17,57,20]]}
["Deutscher Rollsport und Inline Verband e.V.",{"$nulls":24},"Zum Schluss!"]
[]
["Inline-Skaterhockey Deutschland (ISHD)"]
[]
[]
[{"$nulls":25},"Version:","1.4.2025_Saison2025_V3"]
[]
[null,{"$f":"IF(Spielbericht!B13=\"\",\"\",Spielbericht!B13)","v":"Düsseldorf"},{"$nulls":5},{"$f":"IF(Spielbericht!G9=\"\",\"\",Spielbericht!G9)","v":""},{"$nulls":4},{"$f":"IF(Spielbericht!F13=\"\",\"\",Spielbericht!F13)","v":""},{"$nulls":4},"e-Zusatzblatt zum Spielbericht",{"$nulls":4},{"$f":"YEAR(TODAY())","v":2025}]
[null,"Spielort",{"$nulls":5},"Liga",{"$nulls":4},"Datum"]
[null,{"$f":"IF(Spielbericht!C9=\"\",\"\",Spielbericht!C9)","v":""},{"$nulls":4},"-",{"$f":"IF(Spielbericht!C11=\"\",\"\",Spielbericht!C11)","v":""},{"$nulls":9},"Spielnummer:",null,{"$f":"IF(Spielbericht!F15=\"\",\"\",Spielbericht!F15)","v":""}]
{"$rows_left_out":49}
{"sheet":"Strafzeitencodes","index":7,"n_rows":0,"n_cols":0,"rows_kept":0}

{"sheet":"Adressliste Staffelleiter","index":8,"n_rows":29,"n_cols":10,"rows_kept":29,"merged":[[0,0,0,1],[0,3,0,4],[0,6,0,7],[0,9,6,9],[1,0,1,1],[1,3,1,4],[1,6,1,7],[2,0,2,1],[2,3,2,4],[2,6,2,7],[5,0,5,1],[5,3,5,4],[5,6,5,7],[6,0,6,1],[6,3,6,4],[6,6,6,7],[7,0,7,1],[7,3,7,4],[7,6,7,7],[7,9,11,9],[10,0,10,1],[10,3,10,4],[10,6,10,7],[11,0,11,1],[11,3,11,4],[11,6,11,7],[12,0,12,1],[12,3,12,4],[12,6,12,7],[12,9,54,9],[15,0,15,1],[15,3,15,4],[15,6,15,7],[16,0,16,1],[16,3,16,4],[16,6,16,7],[17,0,17,1],[17,3,17,4],[17,6,17,7],[20,0,20,1],[20,3,20,4],[20,6,20,7],[21,0,21,1],[21,3,21,4],[21,6,21,7],[22,0,22,1],[22,3,22,4],[22,6,22,7],[25,0,25,1],[25,3,25,4],[25,6,25,7],[26,0,26,1],[26,3,26,4],[26,6,26,7],[27,0,27,1],[27,3,27,4],[27,6,27,7]]}
["Spielleiter",null,null,"Stellv. Spielleiter (AK H&D)",null,null,"Stellv. Spielleiter (AK Nachwuchs)"]
["Carsten Arndt",null,null,"Detlef Heidrich",null,null,"Gabriele Kickermann"]
["Rauterstr. 4",null,null,"Kamillenweg 10",null,null,"Winkelstr. 6"]
[45139,"Essen",null,58708,"Menden",null,58708,"Menden"]
[]
["1. Herrenbundesliga (1.BL)",null,null,"2. Herrenbundesliga (2.BL)",null,null,"Regionalliga Nord (RLN)"]
["Markus Niehammer",null,null,"Gabriele Kickermann",null,null,"Christian Preising"]
["Schwarzenbergstr. 99",null,null,"Winkelstr. 6",null,null,"Deventerweg 29",null,null,{"$f":"YEAR(TODAY())","v":2025}]
[45472,"Mühlheim an der Ruhr",null,58708,"Menden",null,48317,"Drensteinfurt"]
[]
{"$rows_left_out":20}
{"sheet":"Penaltyschießen","index":9,"n_rows":54,"n_cols":25,"rows_kept":54,"merged":[[0,0,1,13],[0,14,2,19],[0,20,6,20],[0,23,0,24],[2,0,2,13],[3,0,54,0],[3,1,6,19],[5,23,5,24],[7,1,7,5],[7,6,8,6],[7,7,7,8],[7,9,8,9],[7,11,7,13],[7,14,11,14],[7,15,8,19],[7,20,11,20],[8,1,8,5],[8,7,8,8],[8,11,8,13],[9,1,9,5],[9,6,9,7],[9,8,9,13],[9,16,9,19],[10,1,10,5],[10,6,10,7],[10,8,10,13],[10,15,11,19],[11,2,11,3],[11,10,11,13],[12,2,12,19],[12,20,54,20],[13,2,13,5],[13,6,13,11],[13,13,13,14],[13,15,13,19],[14,2,14,5],[14,6,14,11],[14,13,14,14],[14,15,14,19],[15,2,15,19],[16,2,16,19],[17,2,17,19],[18,2,19,2],[18,3,19,4],[18,5,19,7],[18,8,20,10],[18,11,20,11],[18,12,19,12],[18,13,19,13],[18,14,19,16],[18,17,20,19],[20,3,20,4],[20,5,20,7],[20,14,20,16],[21,2,21,19],[22,2,22,19],[23,2,24,2],[23,3,24,3],[23,5,24,7],[23,8,23,10],[23,11,27,11],[23,12,24,12],[23,13,24,13],[23,14,24,16],[23,17,23,19],[24,9,27,9],[24,18,27,18],[25,3,25,4],[25,5,25,7],[25,14,25,16],[26,3,26,4],[26,5,26,7],[26,14,26,16],[27,3,27,4],[27,5,27,7],[27,14,27,16],[28,2,28,19],[29,2,29,19],[30,2,31,2],[30,3,31,4],[30,5,31,7],[30,8,30,10],[30,11,33,11],[30,12,31,12],[30,13,31,13],[30,14,31,16],[30,17,30,19],[31,9,33,9],[31,18,33,18],[32,3,32,4],[32,5,32,7],[32,14,32,16],[33,3,33,4],[33,5,33,7],[33,14,33,16],[34,2,34,19],[35,2,35,19],[36,2,37,2],[36,3,37,4],[36,5,37,7],[36,8,36,10],[36,11,42,11],[36,12,37,12],[36,13,37,13],[36,14,37,16],[36,17,36,19],[37,9,42,9],[37,18,42,18],[38,3,38,4],[38,5,38,7],[38,14,38,16],[39,3,39,4],[39,5,39,7],[39,14,39,16],[40,3,40,4],[40,5,40,7],[40,14,40,16],[41,3,41,4],[41,5,41,7],[41,14,41,16],[42,3,42,4],[42,5,42,7],[42,14,42,16],[43,2,44,19],[45,2,45,19],[46,2,49,3],[46,4,49,19],[50,2,50,19],[51,2,53,6],[51,7,52,13],[51,14,53,14],[51,15,52,19],[53,7,53,13],[53,15,53,19],[54,2,54,19]]}
["Deutscher Rollsport und Inline Verband e.V.",{"$nulls":22},"Zum Schluss!"]
[]
["Inline-Skaterhockey Deutschland (ISHD)"]
[]
[]
[{"$nulls":23},"Fehler?"]
[]
[null,{"$f":"IF(Spielbericht!B13=\"\",\"\",Spielbericht!B13)","v":"Düsseldorf"},{"$nulls":5},{"$f":"IF(Spielbericht!G9=\"\",\"\",Spielbericht!G9)","v":""},{"$nulls":3},{"$f":"IF(Spielbericht!F13=\"\",\"\",Spielbericht!F13)","v":""},{"$nulls":3},"e-Penaltyschießen",{"$nulls":4},{"$f":"YEAR(TODAY())","v":2025}]
[null,"Spielort",{"$nulls":5},"Liga",{"$nulls":3},"Datum"]
[null,{"$f":"IF(Spielbericht!C9=\"\",\"\",Spielbericht!C9)","v":""},{"$nulls":4},"-",null,{"$f":"IF(Spielbericht!C11=\"\",\"\",Spielbericht!C11)","v":""},{"$nulls":6},"Spielnummer:",{"$f":"IF(Spielbericht!F15=\"\",\"\",Spielbericht!F15)","v":""}]
{"$rows_left_out":45}
{"sheet":"BesondereVorkommnisse","index":10,"n_rows":61,"n_cols":23,"rows_kept":61,"merged":[[0,0,1,11],[0,21,0,22],[2,0,2,11],[4,21,4,22],[7,1,7,5],[7,7,7,8],[7,10,7,11],[7,13,7,17],[7,18,12,18],[8,1,8,5],[8,7,8,8],[8,10,8,11],[8,13,12,17],[10,1,10,5],[10,6,10,7],[10,8,10,11],[11,1,11,5],[11,8,11,11],[14,1,14,11],[14,15,14,16],[16,1,16,8],[16,10,16,11],[16,13,16,17],[17,1,17,8],[17,10,17,11],[17,13,17,17],[19,1,19,8],[19,10,19,11],[19,13,19,17],[20,1,20,8],[20,10,20,11],[20,13,20,17],[22,1,22,8],[22,10,22,11],[22,13,22,17],[23,1,23,8],[23,10,23,11],[23,13,23,17],[25,1,25,17],[27,1,27,8],[27,10,27,11],[27,13,27,14],[27,16,27,17],[28,1,29,8],[28,10,29,11],[28,13,29,14],[28,16,29,17],[31,1,31,17],[33,1,33,12],[34,1,34,5],[34,6,34,12],[35,3,35,12],[36,3,36,12],[37,3,37,12],[40,1,48,17],[50,1,50,5],[50,7,50,8],[50,10,50,11],[50,14,50,17],[52,7,55,11],[52,13,53,17],[54,13,55,17],[57,7,58,10],[57,13,58,17],[59,7,59,10],[59,13,59,17],[60,7,60,17]]}
["Deutscher Rollsport und Inline Verband e.V.",{"$nulls":20},"Zum Schluss!"]
[]
["Inline-Skaterhockey Deutschland (ISHD)"]
[]
[{"$nulls":21},"BV kopieren?"]
[]
[]
[null,{"$f":"IF(Spielbericht!B13=\"\",\"\",Spielbericht!B13)","v":"Düsseldorf"},{"$nulls":5},{"$f":"IF(Spielbericht!G9=\"\",\"\",Spielbericht!G9)","v":""},null,null,{"$f":"IF(Spielbericht!F13=\"\",\"\",Spielbericht!F13)","v":""},null,null,"e-Besondere Vorkommnisse",{"$nulls":4},{"$f":"YEAR(TODAY())","v":2025}]
[null,"Spielort",{"$nulls":5},"Liga",null,null,"Datum",{"$nulls":10},"Version:","1.4.2025_Saison2025_V3"]
[]
{"$rows_left_out":40}